Reaction Details
TargetDelta-type opioid receptor
LigandBDBM50076010
Substrate/Competitorn/a
Meas. Tech.ChEBML_217729
Ki 4.4±n/a nM
Citation Husbands, SMBreeden, SWGrivas, KLewis, JW Ring constrained analogues of the orvinols: the furanomorphides. Bioorg Med Chem Lett9:831-4 (1999) Delta-type opioid receptor
Name:Delta-type opioid receptor
Type:G Protein-Coupled Receptor (GPCR)
Mol. Mass.:40382.98
Organism:Homo sapiens (Human)
Description:Competition binding assays were carried out using membrane preparations from transfected HN9.10 cells that constitutively expressed the delta opioid receptor.
Residue:372
BDBM50076010
NameBDBM50076010
Synonyms:3,17,17,18-tetramethyl-13,16-dioxa-3-azaheptacyclo[13.5.2.12,8.01,6.06,14.07,12.015,19]tricosa-7,9,11-trien-11-ol | CHEMBL169367
TypeSmall organic molecule
Emp. Form.C24H31NO3
Mol. Mass.381.5078
SMILESCC1C2CC34CCC2(OC1(C)C)C1Oc2c5c(CC3N(C)CCC415)ccc2O