Reaction Details
TargetKappa-type opioid receptor
LigandBDBM50076009
Substrate/Competitorn/a
Meas. Tech.ChEMBL_220925 (CHEMBL881609)
Ki 2.4±n/a nM
Citation Husbands, SMBreeden, SWGrivas, KLewis, JW Ring constrained analogues of the orvinols: the furanomorphides. Bioorg Med Chem Lett9:831-4 (1999) Kappa-type opioid receptor
Name:Kappa-type opioid receptor
Type:G Protein-Coupled Receptor (GPCR)
Mol. Mass.:42648.76
Organism:Homo sapiens (Human)
Description:P41145
Residue:380
BDBM50076009
NameBDBM50076009
Synonyms:16-[1-hydroxy-1,2,2-trimethyl-(1R)-propyl]-15-methoxy-3-methyl-(1S,14R,15R)-13-oxa-3-azahexacyclo[13.2.2.12,8.01,6.06,14.07,12]icosa-7,9,11-trien-11-ol | CHEMBL169552
TypeSmall organic molecule
Emp. Form.C26H37NO4
Mol. Mass.427.5763
SMILESCO[C@@]12CCC3(C[C@H]1[C@@](C)(O)C(C)(C)C)[C@H]1Cc4ccc(O)c5O[C@@H]2C3(CCN1C)c45