Reaction Details
TargetMu-type opioid receptor
LigandBDBM50076001
Substrate/Competitorn/a
Meas. Tech.ChEBML_221911
Ki 0.700000±n/a nM
Citation Husbands, SMBreeden, SWGrivas, KLewis, JW Ring constrained analogues of the orvinols: the furanomorphides. Bioorg Med Chem Lett9:831-4 (1999) Mu-type opioid receptor
Name:Mu-type opioid receptor
Type:Enzyme Catalytic Domain
Mol. Mass.:11165.58
Organism:GUINEA PIG
Description:P97266
Residue:98
BDBM50076001
NameBDBM50076001
Synonyms:3-cyclopropylmethyl-18-methyl-(15S)-13,16-dioxa-3-azaheptacyclo[13.5.2.12,8.01,6.06,14.07,12.015,19]tricosa-7,9,11-trien-11-ol | CHEMBL349636
TypeSmall organic molecule
Emp. Form.C25H31NO3
Mol. Mass.393.5185
SMILESC[C@@H]1CO[C@@]23CCC4(C[C@H]12)C1Cc2ccc(O)c5O[C@@H]3C4(CCN1CC1CC1)c25