Reaction Details
TargetMu-type opioid receptor
LigandBDBM50076003
Substrate/Competitorn/a
Meas. Tech.ChEBML_221911
Ki 0.200000±n/a nM
Citation Husbands, SMBreeden, SWGrivas, KLewis, JW Ring constrained analogues of the orvinols: the furanomorphides. Bioorg Med Chem Lett9:831-4 (1999) Mu-type opioid receptor
Name:Mu-type opioid receptor
Type:Enzyme Catalytic Domain
Mol. Mass.:11165.58
Organism:GUINEA PIG
Description:P97266
Residue:98
BDBM50076003
NameBDBM50076003
Synonyms:3-cyclopropylmethyl-18,18-dimethyl-(15S)-13,16-dioxa-3-azaheptacyclo[13.5.2.12,8.01,6.06,14.07,12.015,19]tricosa-7,9,11-trien-11-ol | CHEMBL353876
TypeSmall organic molecule
Emp. Form.C28H37NO3
Mol. Mass.435.5983
SMILESCC1(C)OC23CCC4(CC2C1(C)C)C1Cc2ccc(O)c5OC3C4(CCN1CC1CC1)c25