Reaction Details
TargetKappa-type opioid receptor
LigandBDBM50076011
Substrate/Competitorn/a
Meas. Tech.ChEBML_220922
Ki 0.600000±n/a nM
Citation Husbands, SMBreeden, SWGrivas, KLewis, JW Ring constrained analogues of the orvinols: the furanomorphides. Bioorg Med Chem Lett9:831-4 (1999) Kappa-type opioid receptor
Name:Kappa-type opioid receptor
Type:G Protein-Coupled Receptor (GPCR)
Mol. Mass.:42744.99
Organism:Cavia porcellus (domestic guinea pig)
Description:P41144
Residue:380
BDBM50076011
NameBDBM50076011
Synonyms:3-cyclopropylmethyl-18-methyl-(15S)-13,16-dioxa-3-azaheptacyclo[13.5.2.12,8.01,6.06,14.07,12.015,19]tricosa-7,9,11-trien-11-ol | CHEMBL166853
TypeSmall organic molecule
Emp. Form.C25H31NO3
Mol. Mass.393.5185
SMILESC[C@H]1CO[C@@]23CCC4(C[C@@H]12)[C@H]1Cc2ccc(O)c5O[C@@H]3C4(CCN1CC1CC1)c25