Reaction Details
TargetInterstitial collagenase
LigandBDBM50076995
Substrate/Competitorn/a
Meas. Tech.ChEMBL_101758 (CHEMBL709114)
Ki<1±n/a nM
Citation Cherney, RJWang, LMeyer, DTXue, CBArner, ECCopeland, RACovington, MBHardman, KDWasserman, ZRJaffee, BDDecicco, CP Macrocyclic hydroxamate inhibitors of matrix metalloproteinases and TNF-alpha production. Bioorg Med Chem Lett9:1279-84 (1999) Interstitial collagenase
Name:Interstitial collagenase
Type:Enzyme
Mol. Mass.:54010.26
Organism:Homo sapiens (Human)
Description: P03956
Residue:469
BDBM50076995
NameBDBM50076995
Synonyms:(6S,9R,10S)-10-Hydroxycarbamoyl-9-isobutyl-6-methylcarbamoyl-8-oxo-1,7diaza-cyclotridecane-1-carboxylic acid tert-butyl ester CHEMBL23725
TypeSmall organic molecule
Emp. Form.C23H42N4O6
Mol. Mass.470.6028
SMILESCNC(=O)[C@@H]1CCCCN(CCC[C@@H]([C@@H](CC(C)C)C(=O)N1)C(=O)NO)C(=O)OC(C)(C)C