Reaction Details
TargetAndrogen receptor
LigandBDBM50077100
Substrate/Competitorn/a
Meas. Tech.ChEMBL_36272 (CHEMBL648839)
Ki 22±n/a nM
Citation Higuchi, RIEdwards, JPCaferro, TRRinggenberg, JDKong, JWHamann, LGArienti, KLMarschke, KBDavis, RLFarmer, LJJones, TK 4-Alkyl- and 3,4-dialkyl-1,2,3,4-tetrahydro-8-pyridono[5,6-g]quinolines: potent, nonsteroidal androgen receptor agonists. Bioorg Med Chem Lett9:1335-40 (1999) Androgen receptor
Name:Androgen receptor
Type:Receptor
Mol. Mass.:99185.27
Organism:Homo sapiens (Human)
Description:CHO cells were stably transfected with human AR gene.
Residue:920
BDBM50077100
NameBDBM50077100
Synonyms:6-Isobutyl-4-trifluoromethyl-6,7,8,9-tetrahydro-1H-pyrido[3,2-g]quinolin-2-one | CHEMBL282813
TypeSmall organic molecule
Emp. Form.C17H19F3N2O
Mol. Mass.324.3408
SMILESCC(C)CC1CCNc2cc3[nH]c(=O)cc(c3cc12)C(F)(F)F