Reaction Details
TargetAndrogen receptor
LigandBDBM50077104
Substrate/Competitorn/a
Meas. Tech.ChEMBL_36272 (CHEMBL648839)
Ki 2±n/a nM
Citation Higuchi, RIEdwards, JPCaferro, TRRinggenberg, JDKong, JWHamann, LGArienti, KLMarschke, KBDavis, RLFarmer, LJJones, TK 4-Alkyl- and 3,4-dialkyl-1,2,3,4-tetrahydro-8-pyridono[5,6-g]quinolines: potent, nonsteroidal androgen receptor agonists. Bioorg Med Chem Lett9:1335-40 (1999) Androgen receptor
Name:Androgen receptor
Type:Receptor
Mol. Mass.:99185.27
Organism:Homo sapiens (Human)
Description:CHO cells were stably transfected with human AR gene.
Residue:920
BDBM50077104
NameBDBM50077104
Synonyms:CHEMBL431493 | Cis-(4aR,12bS)-11-Trifluoromethyl-2,3,4,4a,5,6,8,12b-octahydro-1H-6,8-diaza-benzo[a]anthracen-9-one
TypeSmall organic molecule
Emp. Form.C17H17F3N2O
Mol. Mass.322.3249
SMILESFC(F)(F)c1cc(=O)[nH]c2cc3NC[C@@H]4CCCC[C@@H]4c3cc12