Reaction Details
TargetGrowth hormone secretagogue receptor type 1
LigandBDBM50083975
Substrate/Competitorn/a
Meas. Tech.ChEBML_70348
IC50 48±n/a nM
Citation Ye, ZGao, YBakshi, RKChen, MHRohrer, SPFeighner, SDPong, SSHoward, ADBlake, ABirzin, ETLocco, LParmar, RMChan, WWSchaeffer, JMSmith, RGPatchett, AANargund, RP Modeling directed design and biological evaluation of quinazolinones as non-peptidic growth hormone secretagogues. Bioorg Med Chem Lett10:5-8 (2000) Growth hormone secretagogue receptor type 1
Name:Growth hormone secretagogue receptor type 1
Type:Receptor
Mol. Mass.:41334.57
Organism:Homo sapiens (Human)
Description:Receptor binding studies use plasma membranes from LLC PK-1 cells transiently transfected with hGHSR1a.
Residue:366
BDBM50083975
NameBDBM50083975
Synonyms:CHEMBL536706 | N-(5-Amino-pentyl)-2-(4-oxo-2-phenethyl-6-phenyl-4H-quinazolin-3-yl)-acetamide; hydrochloride
TypeSmall organic molecule
Emp. Form.C29H32N4O2
Mol. Mass.468.59
SMILESNCCCCCNC(=O)Cn1c(CCc2ccccc2)nc2ccc(cc2c1=O)-c1ccccc1