Reaction Details
TargetCarbonic anhydrase 1
LigandBDBM50080728
Substrate/Competitorn/a
Meas. Tech.ChEBML_44856
Ki 44±n/a nM
Citation Scozzafava, ASupuran, CT Carbonic anhydrase inhibitors: synthesis of N-morpholylthiocarbonylsulfenylamino aromatic/heterocyclic sulfonamides and their interaction with isozymes I, II and IV. Bioorg Med Chem Lett10:1117-20 (2000) Carbonic anhydrase 1
Name:Carbonic anhydrase 1
Type:Enzyme
Mol. Mass.:28873.37
Organism:Homo sapiens (Human)
Description:P00915
Residue:261
BDBM50080728
NameBDBM50080728
Synonyms:3-{[(4-aminophenyl)sulfonyl]amino}benzenesulfonamide 4-amino-bis-benzenesulfonamide | CHEMBL14182
TypeSmall organic molecule
Emp. Form.C12H13N3O4S2
Mol. Mass.327.379
SMILESNc1ccc(cc1)S(=O)(=O)Nc1cccc(c1)S(N)(=O)=O