Reaction Details
TargetCarbonic anhydrase 4
LigandBDBM50088762
Substrate/Competitorn/a
Meas. Tech.ChEBML_45432
Ki 4±n/a nM
Citation Scozzafava, ASupuran, CT Carbonic anhydrase inhibitors: synthesis of N-morpholylthiocarbonylsulfenylamino aromatic/heterocyclic sulfonamides and their interaction with isozymes I, II and IV. Bioorg Med Chem Lett10:1117-20 (2000) Carbonic anhydrase 4
Name:Carbonic anhydrase 4
Type:Enzyme
Mol. Mass.:35152.74
Organism:Bos taurus (bovine)
Description:Bovine isozyme, isolated from lung microsomes
Residue:312
BDBM50088762
NameBDBM50088762
Synonyms:CHEMBL13614 | N,N-dialkylthio-carbonylsulfenylamino derivative
TypeSmall organic molecule
Emp. Form.C13H16N6O5S5
Mol. Mass.496.628
SMILESNS(=O)(=O)c1nnc(NS(=O)(=O)c2ccc(NSC(=S)N3CCOCC3)cc2)s1