Reaction Details
TargetCarbonic anhydrase 1
LigandBDBM10870
Substrate/Competitorn/a
Meas. Tech.ChEBML_44856
Ki 6±n/a nM
Citation Scozzafava, ASupuran, CT Carbonic anhydrase inhibitors: synthesis of N-morpholylthiocarbonylsulfenylamino aromatic/heterocyclic sulfonamides and their interaction with isozymes I, II and IV. Bioorg Med Chem Lett10:1117-20 (2000) Carbonic anhydrase 1
Name:Carbonic anhydrase 1
Type:Enzyme
Mol. Mass.:28873.37
Organism:Homo sapiens (Human)
Description:P00915
Residue:261
BDBM10870
NameBDBM10870
Synonyms:2-N-(4-aminobenzene)-1,3,4-thiadiazole-2,5-disulfonamide CHEMBL268439 aminobenzolamide deriv. 43 | aromatic/heteroaromatic sulfonamide 15
TypeSmall organic molecule
Emp. Form.C8H9N5O4S3
Mol. Mass.335.383
SMILESNc1ccc(cc1)S(=O)(=O)Nc1nnc(s1)S(N)(=O)=O