Reaction Details
TargetCarbonic anhydrase 2
LigandBDBM50088759
Substrate/Competitorn/a
Meas. Tech.ChEBML_45239
Ki 15±n/a nM
Citation Scozzafava, ASupuran, CT Carbonic anhydrase inhibitors: synthesis of N-morpholylthiocarbonylsulfenylamino aromatic/heterocyclic sulfonamides and their interaction with isozymes I, II and IV. Bioorg Med Chem Lett10:1117-20 (2000) Carbonic anhydrase 2
Name:Carbonic anhydrase 2
Type:Enzyme
Mol. Mass.:29250.71
Organism:Homo sapiens (Human)
Description:P00918
Residue:260
BDBM50088759
NameBDBM50088759
Synonyms:CHEMBL13410 | N,N-dialkylthio-carbonylsulfenylamino derivative
TypeSmall organic molecule
Emp. Form.C11H15ClN4O5S4
Mol. Mass.446.974
SMILESNS(=O)(=O)c1cc(c(NSC(=S)N2CCOCC2)cc1Cl)S(N)(=O)=O