Reaction Details
TargetCarbonic anhydrase 4
LigandBDBM50088774
Substrate/Competitorn/a
Meas. Tech.ChEBML_45432
Ki 24±n/a nM
Citation Scozzafava, ASupuran, CT Carbonic anhydrase inhibitors: synthesis of N-morpholylthiocarbonylsulfenylamino aromatic/heterocyclic sulfonamides and their interaction with isozymes I, II and IV. Bioorg Med Chem Lett10:1117-20 (2000) Carbonic anhydrase 4
Name:Carbonic anhydrase 4
Type:Enzyme
Mol. Mass.:35152.74
Organism:Bos taurus (bovine)
Description:Bovine isozyme, isolated from lung microsomes
Residue:312
BDBM50088774
NameBDBM50088774
Synonyms:4-(2-{[(morpholin-4-ylcarbonothioyl)thio]amino}ethyl)benzenesulfonamide N,N-dialkylthio-carbonylsulfenylamino derivative
TypeSmall organic molecule
Emp. Form.C13H19N3O3S3
Mol. Mass.361.503
SMILESNS(=O)(=O)c1ccc(CCNSC(=S)N2CCOCC2)cc1