Reaction Details
TargetCarbonic anhydrase 1
LigandBDBM50084563
Substrate/Competitorn/a
Meas. Tech.ChEBML_44856
Ki 1±n/a nM
Citation Scozzafava, ASupuran, CT Carbonic anhydrase inhibitors: synthesis of N-morpholylthiocarbonylsulfenylamino aromatic/heterocyclic sulfonamides and their interaction with isozymes I, II and IV. Bioorg Med Chem Lett10:1117-20 (2000) Carbonic anhydrase 1
Name:Carbonic anhydrase 1
Type:Enzyme
Mol. Mass.:28873.37
Organism:Homo sapiens (Human)
Description:P00915
Residue:261
BDBM50084563
NameBDBM50084563
Synonyms:5-(4-Amino-benzenesulfonylimino)-4-methyl-4,5-dihydro-[1,3,4]thiadiazole-2-sulfonic acid amide 5-[4-Amino-benzenesulfonylimino]-4-methyl-4,5-dihydro-[1,3,4]thiadiazole-2-sulfonic acid amide | CHEMBL13630
TypeSmall organic molecule
Emp. Form.C9H11N5O4S3
Mol. Mass.349.41
SMILESCn1nc(s\c1=N\S(=O)(=O)c1ccc(N)cc1)S(N)(=O)=O