Reaction Details
TargetCarbonic anhydrase 2
LigandBDBM10860
Substrate/Competitorn/a
Meas. Tech.ChEBML_45239
Ki 170±n/a nM
Citation Scozzafava, ASupuran, CT Carbonic anhydrase inhibitors: synthesis of N-morpholylthiocarbonylsulfenylamino aromatic/heterocyclic sulfonamides and their interaction with isozymes I, II and IV. Bioorg Med Chem Lett10:1117-20 (2000) Carbonic anhydrase 2
Name:Carbonic anhydrase 2
Type:Enzyme
Mol. Mass.:29250.71
Organism:Homo sapiens (Human)
Description:P00918
Residue:260
BDBM10860
NameBDBM10860
Synonyms:4-(aminomethyl)benzene-1-sulfonamide MAFENIDE aromatic/heteroaromatic sulfonamide 5 | hCA inhibitor, 9
TypeSmall organic molecule
Emp. Form.C7H10N2O2S
Mol. Mass.186.232
SMILESNCc1ccc(cc1)S(N)(=O)=O