Reaction Details
TargetMu-type opioid receptor
LigandBDBM50089072
Substrate/Competitorn/a
Meas. Tech.ChEBML_148697
IC50 20000±n/a nM
Citation Longobardo, LMelck, DSiciliano, RSantini, ADi Marzo, VCammarota, G Beta-casomorphins: substitution of phenylalanine with beta-homo phenylalanine increases the mu-type opioid receptor affinity. Bioorg Med Chem Lett10:1185-8 (2000) Mu-type opioid receptor
Name:Mu-type opioid receptor
Type:G Protein-Coupled Receptor (GPCR)
Mol. Mass.:44503.11
Organism:Rattus norvegicus (rat)
Description:Competition binding assays were carried out using membrane preparations from transfected HN9.10 cells that constitutively expressed the mu opioid receptor.
Residue:398
BDBM50089072
NameBDBM50089072
Synonyms:2-({1-[2-({1-[2-({1-[2-Amino-3-(4-hydroxy-phenyl)-propionyl]-pyrrolidine-2-carbonyl}-amino)-3-phenyl-propionyl]-pyrrolidine-2-carbonyl}-amino)-acetyl]-pyrrolidine-2-carbonyl}-amino)-3-methyl-pentanoic acid | CHEMBL2370605
TypeSmall organic molecule
Emp. Form.C41H55N7O9
Mol. Mass.789.9169
SMILESCC[C@H](C)[C@H](NC(=O)[C@@H]1CCCN1C(=O)CNC(=O)[C@@H]1CCCN1C(=O)[C@H](Cc1ccccc1)NC(=O)[C@@H]1CCCN1C(=O)[C@@H](N)Cc1ccc(O)cc1)C(O)=O