Reaction Details
TargetSodium-dependent serotonin transporter
LigandBDBM22416
Substrate/Competitorn/a
Meas. Tech.ChEBML_201983
Ki 0.530000±n/a nM
Citation Lee, BSChu, SLee, BCChi, DYChoe, YSJeong, KJJin, C Syntheses and binding affinities of 6-nitroquipazine analogues for serotonin transporter. Part 1. Bioorg Med Chem Lett10:1559-62 (2000) Sodium-dependent serotonin transporter
Name:Sodium-dependent serotonin transporter
Type:Multi-pass membrane protein
Mol. Mass.:70168.43
Organism:Rattus norvegicus (rat)
Description:P31652
Residue:630
BDBM22416
NameBDBM22416
Synonyms:(3S,4R)-3-[(1,3-benzodioxol-5-yloxy)methyl]-4-(4-fluorophenyl)piperidine CHEMBL490 US09969700, Paroxetine [3H]Paroxetine
Typeradiolabeled ligand
Emp. Form.C19H20FNO3
Mol. Mass.329.3654
SMILESFc1ccc(cc1)[C@@H]1CCNC[C@H]1COc1ccc2OCOc2c1