Reaction Details
TargetSodium-dependent serotonin transporter
LigandBDBM50090213
Substrate/Competitorn/a
Meas. Tech.ChEBML_201983
Ki 0.910000±n/a nM
Citation Lee, BSChu, SLee, BCChi, DYChoe, YSJeong, KJJin, C Syntheses and binding affinities of 6-nitroquipazine analogues for serotonin transporter. Part 1. Bioorg Med Chem Lett10:1559-62 (2000) Sodium-dependent serotonin transporter
Name:Sodium-dependent serotonin transporter
Type:Multi-pass membrane protein
Mol. Mass.:70168.43
Organism:Rattus norvegicus (rat)
Description:P31652
Residue:630
BDBM50090213
NameBDBM50090213
Synonyms:6-Bromo-2-piperazin-1-yl-quinoline | CHEMBL39164
TypeSmall organic molecule
Emp. Form.C13H14BrN3
Mol. Mass.292.174
SMILESBrc1ccc2nc(ccc2c1)N1CCNCC1