Reaction Details
TargetProthrombin
LigandBDBM50090222
Substrate/Competitorn/a
Meas. Tech.ChEMBL_208894 (CHEMBL814951)
Ki 26±n/a nM
Citation Baettig, UBrown, LBrundish, DDell, CFurzer, AGarman, SJanus, DKane, PDSmith, GWalker, CVCockcroft, XAmbler, JMitchelson, ATalbot, MDTweed, MWills, N The design and synthesis of thrombin inhibitors: analogues of MD805 containing non-polar surrogates for arginine at the P1 position. Bioorg Med Chem Lett10:1563-6 (2000) Prothrombin
Name:Prothrombin
Type:Protein
Mol. Mass.:70029.57
Organism:Homo sapiens (Human)
Description:P00734
Residue:622
BDBM50090222
NameBDBM50090222
Synonyms:CHEMBL39086 | MD805 Analogue
TypeSmall organic molecule
Emp. Form.C28H35FN4O3S2
Mol. Mass.558.731
SMILESCC1(C)CNc2c(C1)cccc2S(=O)(=O)NC(Cc1nc2ccccc2s1)C(=O)N1CCC(CCF)CC1