Reaction Details
TargetProthrombin
LigandBDBM50090237
Substrate/Competitorn/a
Meas. Tech.ChEBML_208894
Ki 780±n/a nM
Citation Baettig, UBrown, LBrundish, DDell, CFurzer, AGarman, SJanus, DKane, PDSmith, GWalker, CVCockcroft, XAmbler, JMitchelson, ATalbot, MDTweed, MWills, N The design and synthesis of thrombin inhibitors: analogues of MD805 containing non-polar surrogates for arginine at the P1 position. Bioorg Med Chem Lett10:1563-6 (2000) Prothrombin
Name:Prothrombin
Type:Protein
Mol. Mass.:70029.57
Organism:Homo sapiens (Human)
Description:P00734
Residue:622
BDBM50090237
NameBDBM50090237
Synonyms:CHEMBL43074 | MD805 Analogue
TypeSmall organic molecule
Emp. Form.C28H36N4O4S2
Mol. Mass.556.74
SMILESCC1(C)CNc2c(C1)cccc2S(=O)(=O)NC(Cc1nc2ccccc2s1)C(=O)N1CCC(CCO)CC1