Reaction Details
TargetKallikrein-1
LigandBDBM50366643
Substrate/Competitorn/a
Meas. Tech.ChEBML_92391
Ki 87000±n/a nM
Citation Baettig, UBrown, LBrundish, DDell, CFurzer, AGarman, SJanus, DKane, PDSmith, GWalker, CVCockcroft, XAmbler, JMitchelson, ATalbot, MDTweed, MWills, N The design and synthesis of thrombin inhibitors: analogues of MD805 containing non-polar surrogates for arginine at the P1 position. Bioorg Med Chem Lett10:1563-6 (2000) Kallikrein-1
Name:Kallikrein-1
Type:Enzyme
Mol. Mass.:28874.69
Organism:Homo sapiens (Human)
Description:P06870
Residue:262
BDBM50366643
NameBDBM50366643
Synonyms:CHEMBL1907778
TypeSmall organic molecule
Emp. Form.C24H39FN4O3S2
Mol. Mass.514.72
SMILESCC1(C)CNc2c(C1)cccc2S(=O)(=O)N[C@@H](CSCCCN)C(=O)N1CCC(CCF)CC1