Reaction Details
TargetPancreatic alpha-amylase
LigandBDBM50451094
Substrate/Competitorn/a
Meas. Tech.ChEMBL_34103 (CHEMBL649732)
Ki<40000±n/a nM
Citation Gerrard, JAPrince, MJAbell, AD Kinetic characterisation of ene-diol-based inhibitors of alpha-amylase. Bioorg Med Chem Lett10:1575-6 (2000) Pancreatic alpha-amylase
Name:Pancreatic alpha-amylase
Type:PROTEIN
Mol. Mass.:57186.64
Organism:Rattus norvegicus
Description:ChEMBL_34101
Residue:508
BDBM50451094
NameBDBM50451094
Synonyms:Ascorbyl Palmitate E304
TypeSmall organic molecule
Emp. Form.C22H38O7
Mol. Mass.414.5329
SMILES[H][C@@]1(OC(=O)C(O)=C1O)[C@@H](O)COC(=O)CCCCCCCCCCCCCCC