Reaction Details
TargetSerine/threonine-protein phosphatase 2A 55 kDa regulatory subunit B
LigandBDBM50110690
Substrate/Competitorn/a
Meas. Tech.ChEBML_161773
IC50 3.4±n/a nM
Citation McCluskey, ABowyer, MCCollins, ESim ATR, naSakoff, JABaldwin, ML Anhydride modified cantharidin analogues: synthesis, inhibition of protein phosphatases 1 and 2A and anticancer activity. Bioorg Med Chem Lett10:1687-90 (2000) Serine/threonine-protein phosphatase 2A 55 kDa regulatory subunit B
Name:Serine/threonine-protein phosphatase 2A 55 kDa regulatory subunit B
Synonyms:Serine-threonine protein phosphatase 2A regulatory subunit
Type:PROTEIN
Mol. Mass.:49694.81
Organism:Gallus gallus
Description:ChEMBL_161937
Residue:426
BDBM50110690
NameBDBM50110690
TypeSmall organic molecule
Emp. Form.C19H27O9P
Mol. Mass.430.386
SMILESC[C@@](O)(\C=C\[C@H]1CC=CC(=O)O1)[C@@H](C[C@@H](O)\C=C/C=C\C=C\CO)OP(O)(O)=O