Reaction Details
TargetGlutamate receptor 4
LigandBDBM17657
Substrate/Competitorn/a
Meas. Tech.ChEBML_90302
Ki 868±n/a nM
Citation Baker, SRBleakman, DEzquerra, JBallyk, BADeverill, MHo, KKamboj, RKCollado, IDomínguez, CEscribano, AMateo, AIPedregal, CRubio, A 4-Alkylidenyl glutamic acids, potent and selective GluR5 agonists. Bioorg Med Chem Lett10:1807-10 (2000) Glutamate receptor 4
Name:Glutamate receptor 4
Type:PROTEIN
Mol. Mass.:100881.87
Organism:Homo sapiens (Human)
Description:ChEMBL_468628
Residue:902
BDBM17657
NameBDBM17657
Synonyms:(2S)-2-aminopentanedioic acid D-Glutamate L-Glu L-Glutamic acid L-gluatmate
TypeAmino Acid
Emp. Form.C5H9NO4
Mol. Mass.147.1293
SMILESN[C@@H](CCC(O)=O)C(O)=O