Reaction Details
TargetP-selectin
LigandBDBM50091500
Substrate/Competitorn/a
Meas. Tech.ChEBML_200026
IC50 450±n/a nM
Citation Kurokawa, KKumihara, HKondo, H A solid-phase synthesis for beta-turn mimetics of sialyl Lewis X. Bioorg Med Chem Lett10:1827-30 (2000) P-selectin
Name:P-selectin
Type:PROTEIN
Mol. Mass.:90834.61
Organism:Homo sapiens (Human)
Description:ChEMBL_1438999
Residue:830
BDBM50091500
NameBDBM50091500
Synonyms:(R)-4-Methylcarbamoyl-4-[(S)-2-(2-tetradecyl-hexadecanoylamino)-3-(3,4,5-trihydroxy-6-hydroxymethyl-tetrahydro-pyran-2-yloxy)-propionylamino]-butyric acid | CHEMBL3215516
TypeSmall organic molecule
Emp. Form.C45H85N3O11
Mol. Mass.844.1699
(CCCCCCCCCCCCCC)C(=O)N[C@@H](CO[C@@H]1O[C@@H](CO)[C@H](O)[C@H](O)[C@H]1O)C(=O)N[C@H](CCC(O)=O)C(=O)NC