Reaction Details
TargetAlpha-1D adrenergic receptor
LigandBDBM50091717
Substrate/Competitorn/a
Meas. Tech.ChEBML_32445
Ki 320±n/a nM
Citation Barrow, JCGlass, KLSelnick, HGFreidinger, RMChang, RSO'Malley, SSWoyden, C Preparation and evaluation of 1,3-diaminocyclopentane-linked dihydropyrimidinone derivatives as selective alpha1a-receptor antagonists. Bioorg Med Chem Lett10:1917-20 (2001) Alpha-1D adrenergic receptor
Name:Alpha-1D adrenergic receptor
Type:Enzyme Catalytic Domain
Mol. Mass.:60485.82
Organism:Homo sapiens (Human)
Description:adrenergic Alpha1D ADRA1D HUMAN::P25100
Residue:572
BDBM50091717
NameBDBM50091717
Synonyms:(S)-4-(3,4-Difluoro-phenyl)-6-methoxymethyl-2-oxo-3-[(1R,3S)-3-(3',4',5',6'-tetrahydro-2'H-[2,4']bipyridinyl-1'-yl)-cyclopentylcarbamoyl]-1,2,3,4-tetrahydro-pyrimidine-5-carboxylic acid methyl ester | CHEMBL293515
TypeSmall organic molecule
Emp. Form.C30H35F2N5O5
Mol. Mass.583.6262
SMILESCOCC1=C([C@@H](N(C(=O)N[C@@H]2CC[C@@H](C2)N2CCC(CC2)c2ccccn2)C(=O)N1)c1ccc(F)c(F)c1)C(=O)OC