Reaction Details
TargetAlpha-1D adrenergic receptor
LigandBDBM50091726
Substrate/Competitorn/a
Meas. Tech.ChEBML_32445
Ki 31±n/a nM
Citation Barrow, JCGlass, KLSelnick, HGFreidinger, RMChang, RSO'Malley, SSWoyden, C Preparation and evaluation of 1,3-diaminocyclopentane-linked dihydropyrimidinone derivatives as selective alpha1a-receptor antagonists. Bioorg Med Chem Lett10:1917-20 (2001) Alpha-1D adrenergic receptor
Name:Alpha-1D adrenergic receptor
Type:Enzyme Catalytic Domain
Mol. Mass.:60485.82
Organism:Homo sapiens (Human)
Description:adrenergic Alpha1D ADRA1D HUMAN::P25100
Residue:572
BDBM50091726
NameBDBM50091726
Synonyms:(S)-3-{(1R,3R)-3-[4-(2-Cyano-phenyl)-piperidin-1-yl]-cyclopentylcarbamoyl}-4-(3,4-difluoro-phenyl)-6-methoxymethyl-2-oxo-1,2,3,4-tetrahydro-pyrimidine-5-carboxylic acid methyl ester | CHEMBL262002
TypeSmall organic molecule
Emp. Form.C32H35F2N5O5
Mol. Mass.607.6476
SMILESCOCC1=C([C@@H](N(C(=O)N[C@@H]2CC[C@H](C2)N2CCC(CC2)c2ccccc2C#N)C(=O)N1)c1ccc(F)c(F)c1)C(=O)OC