Reaction Details
TargetReverse transcriptase/RNaseH
LigandBDBM50091966
Substrate/Competitorn/a
Meas. Tech.ChEMBL_196044 (CHEMBL802221)
Ki 12000±n/a nM
Citation Venkatachalam, TKSudbeck, EAMao, CUckun, FM Stereochemistry of halopyridyl and thiazolyl thiourea compounds is a major determinant of their potency as nonnucleoside inhibitors of HIV-1 reverse transcriptase. Bioorg Med Chem Lett10:2071-4 (2000) Reverse transcriptase/RNaseH
Name:Reverse transcriptase/RNaseH
Type:PROTEIN
Mol. Mass.:65229.15
Organism:Human immunodeficiency virus 1
Description:ChEMBL_1473730
Residue:566
BDBM50091966
NameBDBM50091966
Synonyms:1-((R)-1-Cyclohexyl-ethyl)-3-thiazol-2-yl-thiourea HI-513
TypeSmall organic molecule
Emp. Form.C12H19N3S2
Mol. Mass.269.429
SMILESC[C@@H](NC(=S)Nc1nccs1)C1CCCCC1