Reaction Details
TargetReverse transcriptase/RNaseH
LigandBDBM50078263
Substrate/Competitorn/a
Meas. Tech.ChEMBL_196044 (CHEMBL802221)
Ki 600±n/a nM
Citation Venkatachalam, TKSudbeck, EAMao, CUckun, FM Stereochemistry of halopyridyl and thiazolyl thiourea compounds is a major determinant of their potency as nonnucleoside inhibitors of HIV-1 reverse transcriptase. Bioorg Med Chem Lett10:2071-4 (2000) Reverse transcriptase/RNaseH
Name:Reverse transcriptase/RNaseH
Type:PROTEIN
Mol. Mass.:65229.15
Organism:Human immunodeficiency virus 1
Description:ChEMBL_1473730
Residue:566
BDBM50078263
NameBDBM50078263
Synonyms:1-(5-Bromo-pyridin-2-yl)-3-[2-(2-fluoro-phenyl)-ethyl]-thiourea HI-240
TypeSmall organic molecule
Emp. Form.C14H13BrFN3S
Mol. Mass.354.241
SMILESFc1ccccc1CCNC(=S)Nc1ccc(Br)cn1