Reaction Details
TargetReverse transcriptase/RNaseH
LigandBDBM50091972
Substrate/Competitorn/a
Meas. Tech.ChEMBL_195054 (CHEMBL798358)
IC50>100000±n/a nM
Citation Venkatachalam, TKSudbeck, EAMao, CUckun, FM Stereochemistry of halopyridyl and thiazolyl thiourea compounds is a major determinant of their potency as nonnucleoside inhibitors of HIV-1 reverse transcriptase. Bioorg Med Chem Lett10:2071-4 (2000) Reverse transcriptase/RNaseH
Name:Reverse transcriptase/RNaseH
Type:PROTEIN
Mol. Mass.:65229.15
Organism:Human immunodeficiency virus 1
Description:ChEMBL_1473730
Residue:566
BDBM50091972
NameBDBM50091972
Synonyms:1-(5-Bromo-pyridin-2-yl)-3-((S)-1-cyclohexyl-ethyl)-thiourea HI-509
TypeSmall organic molecule
Emp. Form.C14H20BrN3S
Mol. Mass.342.298
SMILESC[C@H](NC(=S)Nc1ccc(Br)cn1)C1CCCCC1