Reaction Details
TargetProtein kinase C delta type
LigandBDBM50092015
Substrate/Competitorn/a
Meas. Tech.ChEMBL_160942 (CHEMBL769105)
Ki 68±n/a nM
Citation Nakagawa, YIrie, KOhigashi, HHayashi, HWender, PA Synthesis and PKC isozyme surrogate binding of indothiolactam-V, a new thioamide analogue of tumor promoting indolactam-V. Bioorg Med Chem Lett10:2087-90 (2000) Protein kinase C delta type
Name:Protein kinase C delta type
Type:Enzyme
Mol. Mass.:77516.79
Organism:Homo sapiens (Human)
Description:The recombinant human PKC enzymes were produced using a baculovirus expression system in SF9 cells
Residue:676
BDBM50092015
NameBDBM50092015
Synonyms:(10S,13S)-13-Hydroxymethyl-10-isopropyl-9-methyl-3,9,12-triaza-tricyclo[6.6.1.0*4,15*]pentadeca-1,4,6,8(15)-tetraene-11-thione | CHEMBL63262
TypeSmall organic molecule
Emp. Form.C17H23N3OS
Mol. Mass.317.449
SMILESCC(C)[C@@H]1N(C)c2cccc3[nH]cc(C[C@@H](CO)NC1=S)c23