Reaction Details
TargetEstrogen receptor
LigandBDBM50366663
Substrate/Competitorn/a
Meas. Tech.ChEMBL_67488 (CHEMBL679325)
IC50 32±n/a nM
Citation Miller, CPJirkovsky, ITran, BDHarris, HAMoran, RAKomm, BS Synthesis and estrogenic activities of novel 7-thiosubstituted estratriene derivatives. Bioorg Med Chem Lett10:147-51 (2000) Estrogen receptor
Name:Estrogen receptor
Type:Protein
Mol. Mass.:66230.44
Organism:Homo sapiens (Human)
Description:P03372
Residue:595
BDBM50366663
NameBDBM50366663
Synonyms:CHEMBL1627351
TypeSmall organic molecule
Emp. Form.C34H55NO4S
Mol. Mass.573.87
SMILESCCCCN(C)C(=O)CCCCCCCCCCS[C@@H]1[C@H](O)c2cc(O)ccc2[C@H]2CC[C@]3(C)[C@@H](O)CC[C@H]3[C@H]12