Reaction Details
TargetEstrogen receptor beta
LigandBDBM50366662
Substrate/Competitorn/a
Meas. Tech.ChEBML_67812
IC50 59±n/a nM
Citation Miller, CPJirkovsky, ITran, BDHarris, HAMoran, RAKomm, BS Synthesis and estrogenic activities of novel 7-thiosubstituted estratriene derivatives. Bioorg Med Chem Lett10:147-51 (2000) Estrogen receptor beta
Name:Estrogen receptor beta
Type:Protein
Mol. Mass.:59238.43
Organism:Homo sapiens (Human)
Description:Q92731
Residue:530
BDBM50366662
NameBDBM50366662
Synonyms:CHEMBL1627356
TypeSmall organic molecule
Emp. Form.C29H35NO3S
Mol. Mass.477.658
SMILESCN(C)C(=O)\C=C\c1ccc(S[C@@H]2Cc3cc(O)ccc3[C@H]3CC[C@]4(C)[C@@H](O)CC[C@H]4[C@H]23)cc1