Reaction Details
TargetATP-dependent translocase ABCB1
LigandBDBM50218276
Substrate/Competitorn/a
Meas. Tech.ChEMBL_147985 (CHEMBL753513)
Kd 6800±n/a nM
Citation Maitrejean, MComte, GBarron, DEl Kirat, KConseil, GDi Pietro, A The flavanolignan silybin and its hemisynthetic derivatives, a novel series of potential modulators of P-glycoprotein. Bioorg Med Chem Lett10:157-60 (2000) ATP-dependent translocase ABCB1
Name:ATP-dependent translocase ABCB1
Type:Protein
Mol. Mass.:140669.02
Organism:Mus musculus (Mouse)
Description:P21447
Residue:1276
BDBM50218276
NameBDBM50218276
Synonyms:Silibinin | Silymarin
TypeSmall organic molecule
Emp. Form.C25H22O10
Mol. Mass.482.4362
SMILESCOc1cc(ccc1O)C1Oc2cc(ccc2OC1CO)C1Oc2cc(O)cc(O)c2C(=O)C1O