Reaction Details
TargetMu-type opioid receptor
LigandBDBM50085024
Substrate/Competitorn/a
Meas. Tech.ChEBML_145278
Ki 780±n/a nM
Citation Wentland, MPXu, GCioffi, CLYe, YDuan, WCohen, DJColasurdo, AMBidlack, JM 8-Aminocyclazocine analogues: synthesis and structure-activity relationships. Bioorg Med Chem Lett10:183-7 (2000) Mu-type opioid receptor
Name:Mu-type opioid receptor
Type:Enzyme Catalytic Domain
Mol. Mass.:11165.58
Organism:GUINEA PIG
Description:P97266
Residue:98
BDBM50085024
NameBDBM50085024
Synonyms:(6S,11R)-3-Cyclopropylmethyl-6,11-dimethyl-1,2,3,4,5,6-hexahydro-2,6-methano-benzo[d]azocin-8-ylamine 3-Cyclopropylmethyl-6,11-dimethyl-1,2,3,4,5,6-hexahydro-2,6-methano-benzo[d]azocin-8-ylamine.2HCl | CHEMBL52399
TypeSmall organic molecule
Emp. Form.C18H26N2
Mol. Mass.270.4124
SMILESC[C@H]1C2Cc3ccc(N)cc3[C@@]1(C)CCN2CC1CC1