Reaction Details
TargetKappa-type opioid receptor
LigandBDBM50369586
Substrate/Competitorn/a
Meas. Tech.ChEMBL_146512 (CHEMBL754621)
Ki 0.540±n/a nM
Citation Wentland, MPXu, GCioffi, CLYe, YDuan, WCohen, DJColasurdo, AMBidlack, JM 8-Aminocyclazocine analogues: synthesis and structure-activity relationships. Bioorg Med Chem Lett10:183-7 (2000) Kappa-type opioid receptor
Name:Kappa-type opioid receptor
Type:G Protein-Coupled Receptor (GPCR)
Mol. Mass.:42744.99
Organism:Cavia porcellus (domestic guinea pig)
Description:P41144
Residue:380
BDBM50369586
NameBDBM50369586
Synonyms:CHEMBL326516
TypeSmall organic molecule
Emp. Form.C24H30N2
Mol. Mass.346.5084
SMILESC[C@H]1[C@H]2Cc3ccc(Nc4ccccc4)cc3[C@@]1(C)CCN2CC1CC1