Reaction Details
TargetMu-type opioid receptor
LigandBDBM50085021
Substrate/Competitorn/a
Meas. Tech.ChEMBL_145278 (CHEMBL751214)
Ki 1.5±n/a nM
Citation Wentland, MPXu, GCioffi, CLYe, YDuan, WCohen, DJColasurdo, AMBidlack, JM 8-Aminocyclazocine analogues: synthesis and structure-activity relationships. Bioorg Med Chem Lett10:183-7 (2000) Mu-type opioid receptor
Name:Mu-type opioid receptor
Type:Enzyme Catalytic Domain
Mol. Mass.:11165.58
Organism:GUINEA PIG
Description:P97266
Residue:98
BDBM50085021
NameBDBM50085021
Synonyms:Benzyl-((6S,11R)-3-cyclopropylmethyl-6,11-dimethyl-1,2,3,4,5,6-hexahydro-2,6-methano-benzo[d]azocin-8-yl)-amine Benzyl-(3-cyclopropylmethyl-6,11-dimethyl-1,2,3,4,5,6-hexahydro-2,6-methano-benzo[d]azocin-8-yl)-amine.2HCl | CHEMBL301835
TypeSmall organic molecule
Emp. Form.C25H32N2
Mol. Mass.360.535
SMILESC[C@H]1C2Cc3ccc(NCc4ccccc4)cc3[C@@]1(C)CCN2CC1CC1