Reaction Details
TargetReverse transcriptase/RNaseH
LigandBDBM2898
Substrate/Competitorn/a
Meas. Tech.ChEBML_195837
IC50 31±n/a nM
Citation Corbett, JWGearhart, LAKo, SSRodgers, JDCordova, BCKlabe, RMErickson-Viitanen, SK Novel 2,2-dioxide-4,4-disubstituted-1,3-H-2,1,3-benzothiadiazines as non-nucleoside reverse transcriptase inhibitors. Bioorg Med Chem Lett10:193-5 (2000) Reverse transcriptase/RNaseH
Name:Reverse transcriptase/RNaseH
Type:PROTEIN
Mol. Mass.:65229.15
Organism:Human immunodeficiency virus 1
Description:ChEMBL_1473730
Residue:566
BDBM2898
NameBDBM2898
Synonyms:(4S)-6-chloro-4-(2-cyclopropylethynyl)-4-(trifluoromethyl)-1,2,3,4-tetrahydroquinazolin-2-one DPC961
TypeSmall organic molecule
Emp. Form.C14H10ClF3N2O
Mol. Mass.314.69
SMILESFC(F)(F)[C@]1(NC(=O)Nc2ccc(Cl)cc12)C#CC1CC1