Reaction Details
TargetReverse transcriptase/RNaseH
LigandBDBM50085035
Substrate/Competitorn/a
Meas. Tech.ChEBML_195837
IC50 137±n/a nM
Citation Corbett, JWGearhart, LAKo, SSRodgers, JDCordova, BCKlabe, RMErickson-Viitanen, SK Novel 2,2-dioxide-4,4-disubstituted-1,3-H-2,1,3-benzothiadiazines as non-nucleoside reverse transcriptase inhibitors. Bioorg Med Chem Lett10:193-5 (2000) Reverse transcriptase/RNaseH
Name:Reverse transcriptase/RNaseH
Type:PROTEIN
Mol. Mass.:65229.15
Organism:Human immunodeficiency virus 1
Description:ChEMBL_1473730
Residue:566
BDBM50085035
NameBDBM50085035
Synonyms:6-Chloro-4-isopropyl-4-(3-methyl-but-1-ynyl)-3,4-dihydro-1H-benzo[1,2,6]thiadiazine 2,2-dioxide | CHEMBL58596
TypeSmall organic molecule
Emp. Form.C15H19ClN2O2S
Mol. Mass.326.842
SMILESCC(C)C#CC1(NS(=O)(=O)Nc2ccc(Cl)cc12)C(C)C