Reaction Details
TargetDelta-type opioid receptor
LigandBDBM50093000
Substrate/Competitorn/a
Meas. Tech.ChEMBL_145494 (CHEMBL752136)
Ki 3.3±n/a nM
Citation Jales, ARHusbands, SMLewis, JW Selective kappa-opioid antagonists related to naltrindole. Effect of side-chain spacer in the 5'-amidinoalkyl series. Bioorg Med Chem Lett10:2259-61 (2001) Delta-type opioid receptor
Name:Delta-type opioid receptor
Type:G Protein-Coupled Receptor (GPCR)
Mol. Mass.:40382.98
Organism:Homo sapiens (Human)
Description:Competition binding assays were carried out using membrane preparations from transfected HN9.10 cells that constitutively expressed the delta opioid receptor.
Residue:372
BDBM50093000
NameBDBM50093000
Synonyms:CHEMBL70693 | Derivative of Natrindole
TypeSmall organic molecule
Emp. Form.C33H40N4O3
Mol. Mass.540.6957
SMILESCCCCC(=N)NCCc1ccc2[nH]c3C4Oc5c6c(CC7N(CC8CC8)CCC46[C@@]7(O)Cc3c2c1)ccc5O