Reaction Details
TargetGenome polyprotein
LigandBDBM50071983
Substrate/Competitorn/a
Meas. Tech.ChEBML_143624
IC50 22000±n/a nM
Citation Llinàs-Brunet, MBailey, MFazal, GGhiro, EGorys, VGoulet, SHalmos, TMaurice, RPoirier, MPoupart, MARancourt, JThibeault, DWernic, DLamarre, D Highly potent and selective peptide-based inhibitors of the hepatitis C virus serine protease: towards smaller inhibitors. Bioorg Med Chem Lett10:2267-70 (2001) Genome polyprotein
Name:Genome polyprotein
Type:Protein
Mol. Mass.:67067.41
Organism:Hepatitis C virus
Description:A3EZI9
Residue:631
BDBM50071983
NameBDBM50071983
Synonyms:(S)-3-((S)-2-Acetylamino-3-carboxy-propionylamino)-N-[(1S,2S)-2-methyl-1-((S)-2-methyl-1-{2-[(S)-1-(2,2,2-trifluoro-acetyl)-butylcarbamoyl]-pyrrolidine-1-carbonyl}-propylcarbamoyl)-butyl]-succinamic acid | CHEMBL310738
TypeSmall organic molecule
Emp. Form.C32H49F3N6O11
Mol. Mass.750.7603
SMILESCCC[C@H](NC(=O)[C@@H]1CCCN1C(=O)[C@@H](NC(=O)[C@@H](NC(=O)[C@@H](CC(O)=O)NC(=O)[C@H](CC(O)=O)NC(C)=O)[C@@H](C)CC)C(C)C)C(=O)C(F)(F)F