Reaction Details
TargetGenome polyprotein
LigandBDBM50071975
Substrate/Competitorn/a
Meas. Tech.ChEBML_143624
IC50 17000±n/a nM
Citation Llinàs-Brunet, MBailey, MFazal, GGhiro, EGorys, VGoulet, SHalmos, TMaurice, RPoirier, MPoupart, MARancourt, JThibeault, DWernic, DLamarre, D Highly potent and selective peptide-based inhibitors of the hepatitis C virus serine protease: towards smaller inhibitors. Bioorg Med Chem Lett10:2267-70 (2001) Genome polyprotein
Name:Genome polyprotein
Type:Protein
Mol. Mass.:67067.41
Organism:Hepatitis C virus
Description:A3EZI9
Residue:631
BDBM50071975
NameBDBM50071975
Synonyms:(S)-3-((S)-2-Acetylamino-3-carboxy-propionylamino)-N-((1S,2S)-1-{(S)-1-[2-((S)-1-carboxy-propylcarbamoyl)-pyrrolidine-1-carbonyl]-2-methyl-propylcarbamoyl}-2-methyl-butyl)-succinamic acid | CHEMBL306027
TypeSmall organic molecule
Emp. Form.C31H50N6O12
Mol. Mass.698.7617
SMILESCCC[C@H](NC(=O)[C@@H]1CCCN1C(=O)[C@@H](NC(=O)[C@@H](NC(=O)[C@@H](CC(O)=O)NC(=O)[C@H](CC(O)=O)NC(C)=O)[C@@H](C)CC)C(C)C)C(O)=O