Reaction Details
TargetGenome polyprotein
LigandBDBM50093021
Substrate/Competitorn/a
Meas. Tech.ChEBML_143624
IC50 6800±n/a nM
Citation Llinàs-Brunet, MBailey, MFazal, GGhiro, EGorys, VGoulet, SHalmos, TMaurice, RPoirier, MPoupart, MARancourt, JThibeault, DWernic, DLamarre, D Highly potent and selective peptide-based inhibitors of the hepatitis C virus serine protease: towards smaller inhibitors. Bioorg Med Chem Lett10:2267-70 (2001) Genome polyprotein
Name:Genome polyprotein
Type:Protein
Mol. Mass.:67067.41
Organism:Hepatitis C virus
Description:A3EZI9
Residue:631
BDBM50093021
NameBDBM50093021
Synonyms:(S)-2-{[(2S,4R)-1-((S)-2-{(2S,3S)-2-[(S)-2-((S)-2-Acetylamino-3-carboxy-propionylamino)-3-carboxy-propionylamino]-3-methyl-pentanoylamino}-3-methyl-butyryl)-4-(2-methyl-benzyloxy)-pyrrolidine-2-carbonyl]-amino}-pentanoic acid | CHEMBL75579
TypeSmall organic molecule
Emp. Form.C39H58N6O13
Mol. Mass.818.9102
SMILESCCC[C@H](NC(=O)[C@@H]1C[C@H](CN1C(=O)[C@@H](NC(=O)[C@@H](NC(=O)[C@H](CC(O)=O)NC(=O)[C@H](CC(O)=O)NC(C)=O)[C@@H](C)CC)C(C)C)OCc1ccccc1C)C(O)=O