Reaction Details
TargetGenome polyprotein
LigandBDBM50093022
Substrate/Competitorn/a
Meas. Tech.ChEBML_143624
IC50 93000±n/a nM
Citation Llinàs-Brunet, MBailey, MFazal, GGhiro, EGorys, VGoulet, SHalmos, TMaurice, RPoirier, MPoupart, MARancourt, JThibeault, DWernic, DLamarre, D Highly potent and selective peptide-based inhibitors of the hepatitis C virus serine protease: towards smaller inhibitors. Bioorg Med Chem Lett10:2267-70 (2001) Genome polyprotein
Name:Genome polyprotein
Type:Protein
Mol. Mass.:67067.41
Organism:Hepatitis C virus
Description:A3EZI9
Residue:631
BDBM50093022
NameBDBM50093022
Synonyms:(S)-2-{[(2S,4R)-1-((S)-2-{(2S,3S)-2-[(S)-2-((S)-2-Acetylamino-3-carboxy-propionylamino)-3-carboxy-propionylamino]-3-methyl-pentanoylamino}-3-methyl-butyryl)-4-hydroxy-pyrrolidine-2-carbonyl]-amino}-pentanoic acid | CHEMBL306026
TypeSmall organic molecule
Emp. Form.C31H50N6O13
Mol. Mass.714.7611
SMILESCCC[C@H](NC(=O)[C@@H]1C[C@@H](O)CN1C(=O)[C@@H](NC(=O)[C@@H](NC(=O)[C@H](CC(O)=O)NC(=O)[C@H](CC(O)=O)NC(C)=O)[C@@H](C)CC)C(C)C)C(O)=O