Reaction Details
TargetCathepsin B
LigandBDBM50093010
Substrate/Competitorn/a
Meas. Tech.ChEBML_44953
IC50>300000±n/a nM
Citation Llinàs-Brunet, MBailey, MFazal, GGhiro, EGorys, VGoulet, SHalmos, TMaurice, RPoirier, MPoupart, MARancourt, JThibeault, DWernic, DLamarre, D Highly potent and selective peptide-based inhibitors of the hepatitis C virus serine protease: towards smaller inhibitors. Bioorg Med Chem Lett10:2267-70 (2001) Cathepsin B
Name:Cathepsin B
Type:Enzyme
Mol. Mass.:37819.69
Organism:Homo sapiens (Human)
Description:gi_63102437
Residue:339
BDBM50093010
NameBDBM50093010
Synonyms:(S)-2-{[(2S,4R)-1-((S)-2-{(S)-2-[(R)-2-((S)-2-Acetylamino-3-carboxy-propionylamino)-4-carboxy-butyrylamino]-2-cyclohexyl-acetylamino}-3-methyl-butyryl)-4-(naphthalen-2-ylmethoxy)-pyrrolidine-2-carbonyl]-amino}-pentanoic acid | CHEMBL432156
TypeSmall organic molecule
Emp. Form.C45H62N6O13
Mol. Mass.895.0062
SMILESCCC[C@H](NC(=O)[C@@H]1C[C@H](CN1C(=O)[C@@H](NC(=O)[C@@H](NC(=O)[C@@H](CCC(O)=O)NC(=O)[C@H](CC(O)=O)NC(C)=O)C1CCCCC1)C(C)C)OCc1ccc2ccccc2c1)C(O)=O