Reaction Details
TargetMu-type opioid receptor
LigandBDBM50095151
Substrate/Competitorn/a
Meas. Tech.ChEBML_148679
Ki 10±n/a nM
Citation Cardillo, GGentilucci, LMelchiorre, PSpampinato, S Synthesis and binding activity of endomorphin-1 analogues containing beta-amino acids. Bioorg Med Chem Lett10:2755-8 (2000) Mu-type opioid receptor
Name:Mu-type opioid receptor
Type:G Protein-Coupled Receptor (GPCR)
Mol. Mass.:44503.11
Organism:Rattus norvegicus (rat)
Description:Competition binding assays were carried out using membrane preparations from transfected HN9.10 cells that constitutively expressed the mu opioid receptor.
Residue:398
BDBM50095151
NameBDBM50095151
Synonyms:(S)-2-[(S)-2-(2-{1-[(S)-2-Amino-3-((S)-4-hydroxy-phenyl)-propionyl]-pyrrolidin-2-yl}-acetylamino)-3-(1H-indol-3-yl)-propionylamino]-3-phenyl-propionamide CHEMBL316447
TypeSmall organic molecule
Emp. Form.C35H40N6O5
Mol. Mass.624.7293
SMILESN[C@@H](Cc1ccc(O)cc1)C(=O)N1CCC[C@H]1CC(=O)N[C@@H](Cc1c[nH]c2ccccc12)C(=O)N[C@@H](Cc1ccccc1)C(N)=O