Reaction Details
TargetMu-type opioid receptor
LigandBDBM50095157
Substrate/Competitorn/a
Meas. Tech.ChEBML_148679
Ki>1000±n/a nM
Citation Cardillo, GGentilucci, LMelchiorre, PSpampinato, S Synthesis and binding activity of endomorphin-1 analogues containing beta-amino acids. Bioorg Med Chem Lett10:2755-8 (2000) Mu-type opioid receptor
Name:Mu-type opioid receptor
Type:G Protein-Coupled Receptor (GPCR)
Mol. Mass.:44503.11
Organism:Rattus norvegicus (rat)
Description:Competition binding assays were carried out using membrane preparations from transfected HN9.10 cells that constitutively expressed the mu opioid receptor.
Residue:398
BDBM50095157
NameBDBM50095157
Synonyms:1-[(R)-2-Amino-3-(4-hydroxy-phenyl)-propionyl]-pyrrolidine-2-carboxylic acid [(S)-2-((S)-1-carbamoyl-2-phenyl-ethylcarbamoyl)-1-(1H-indol-3-yl)-ethyl]-amide | CHEMBL407917
TypeSmall organic molecule
Emp. Form.C34H38N6O5
Mol. Mass.610.7027
SMILESN[C@@H](Cc1ccc(O)cc1)C(=O)N1CCC[C@H]1C(=O)N[C@H](CC(=O)N[C@@H](Cc1ccccc1)C(N)=O)c1c[nH]c2ccccc12