Reaction Details
TargetNitric oxide synthase, inducible
LigandBDBM50095172
Substrate/Competitorn/a
Meas. Tech.ChEBML_89175
Ki 120±n/a nM
Citation Lee, YMartásek, PRoman, LJSilverman, RB 1H-pyrazole-1-carboxamidines: new inhibitors of nitric oxide synthase. Bioorg Med Chem Lett10:2771-4 (2000) Nitric oxide synthase, inducible
Name:Nitric oxide synthase, inducible
Type:Enzyme
Mol. Mass.:130595.79
Organism:Mus musculus (mouse)
Description:Recombinant enzyme overexpressed in E. coli.
Residue:1144
BDBM50095172
NameBDBM50095172
Synonyms:CHEMBL262040 N-[3-(aminomethyl)phenyl]thiophene-2-carboximidamide
TypeSmall organic molecule
Emp. Form.C12H13N3S
Mol. Mass.231.317
SMILESNCc1cccc(NC(=N)c2cccs2)c1