Reaction Details
TargetNitric oxide synthase, brain
LigandBDBM50095172
Substrate/Competitorn/a
Meas. Tech.ChEBML_143213
Ki 8.70±n/a nM
Citation Lee, YMartásek, PRoman, LJSilverman, RB 1H-pyrazole-1-carboxamidines: new inhibitors of nitric oxide synthase. Bioorg Med Chem Lett10:2771-4 (2000) Nitric oxide synthase, brain
Name:Nitric oxide synthase, brain
Type:Enzyme
Mol. Mass.:160570.98
Organism:Rattus norvegicus (rat)
Description:Recombinant nNOS overexpressed in E. coli was used in enzyme assays.
Residue:1429
BDBM50095172
NameBDBM50095172
Synonyms:CHEMBL262040 N-[3-(aminomethyl)phenyl]thiophene-2-carboximidamide
TypeSmall organic molecule
Emp. Form.C12H13N3S
Mol. Mass.231.317
SMILESNCc1cccc(NC(=N)c2cccs2)c1